photo_image.id,photo_image.ts,photo_image.source_content_type,photo_image.hash_file_content,photo_image.size,photo_image.path,photo_image.title,photo_image.access,image_slug.id,image_slug.ts,image_slug.title,profession.id,profession.ts,profession.title,profession.city,profession.description,profession.votes,profession.guests_from,profession.guests_to,profession.score,profession.address,profession.region,profession.postalcode,profession.telephone_hide,profession.telephone,profession.latitude,profession.longitude,profession.review_count,profession.typical_price,profession.service_quality,profession.responsiveness,profession.professionalism,profession.value,profession.flexibility,profession.web_site
1,"2018-11-22 10:10:17",image/jpeg,a4dcf15debbf767cd717039dc3b1d0f935c2445f,109435,/a4/dc/f1/5d/a4dcf15debbf767cd717039dc3b1d0f935c2445f.jpg,,http://n3.datasn.io/data/api/v1/n3_lyz/wedding_service_information_of_usa_1/by_table/photo_image_access/a4/dc/f1/5d/a4dcf15debbf767cd717039dc3b1d0f935c2445f.jpg,1,"2018-11-12 12:04:27","Wedding celebration",1,"2018-11-12 16:05:55","Alyeska Resort",Girdwood,"<p>Alyeska Resort is a premier wedding venue located in Girdwood, Alaska. Couples can host their dream wedding with the stunning Chugach Mountains as a backdrop. Settled in a valley surrounded by mountain peaks, glaciers, and a scenic view of the ocean, the venue provides guests with luxurious accommodations and access to the magnificent Alaskan wilderness.<br/> <br/> <strong>Facilities and Capacity</strong><br/> Alyeska Resort offers a variety of indoor and outdoor event spaces. From traditional banquet-style receptions to private outdoor celebrations, the venue offers spaces that are fully customizable to couples' preferences. The resort can accommodate a maximum of 200 guests in any of the following facilities:</p> <ul> <li>Columbia ballroom</li> <li>Kahiltna court</li> <li>Pond courtyard</li> </ul> <p><br/> <strong>Services Offered</strong><br/> Alyeska Resort provides a variety of services for wedding ceremonies, receptions, engagement parties, rehearsal dinners, and elopements. These services include:</p> <ul> <li>Accommodations</li> <li>Clean up</li> <li>Set up</li> <li>Buffet</li> <li>Bridal suite</li> <li>Liability insurance</li> <li>Event planning</li> <li>Outside vendors</li> </ul> <p><br/> <strong>Cuisine</strong><br/> Alyeska Resort has several restaurants, each with unique settings and specialties. It provides various serving options such as buffet, dessert, stations, plated, and more.<br/> <br/> <strong>Accommodation</strong><br/> The Hotel Alyeska provides luxurious accommodations for couples and guests. Its featured guest amenities include a 60-passenger aerial scenic tram, a saltwater pool, a whirlpool, a fitness center, and more.</p> </div>",16,2,200,4.6,"PO Box 249",Girdwood,99587,,9077541111,60.9602,-149.126,16,,4.6,4.6,4.7,4.5,4.5,http://www.alyeskaresort.com/meetings-weddings
2,"2018-11-22 10:11:21",image/jpeg,7da9586a2833af7d8a1345ed8db1390f6e44429c,76633,/7d/a9/58/6a/7da9586a2833af7d8a1345ed8db1390f6e44429c.jpg,,http://n3.datasn.io/data/api/v1/n3_lyz/wedding_service_information_of_usa_1/by_table/photo_image_access/7d/a9/58/6a/7da9586a2833af7d8a1345ed8db1390f6e44429c.jpg,2,"2018-11-12 12:04:27","Reception area",1,"2018-11-12 16:05:55","Alyeska Resort",Girdwood,"<p>Alyeska Resort is a premier wedding venue located in Girdwood, Alaska. Couples can host their dream wedding with the stunning Chugach Mountains as a backdrop. Settled in a valley surrounded by mountain peaks, glaciers, and a scenic view of the ocean, the venue provides guests with luxurious accommodations and access to the magnificent Alaskan wilderness.<br/> <br/> <strong>Facilities and Capacity</strong><br/> Alyeska Resort offers a variety of indoor and outdoor event spaces. From traditional banquet-style receptions to private outdoor celebrations, the venue offers spaces that are fully customizable to couples' preferences. The resort can accommodate a maximum of 200 guests in any of the following facilities:</p> <ul> <li>Columbia ballroom</li> <li>Kahiltna court</li> <li>Pond courtyard</li> </ul> <p><br/> <strong>Services Offered</strong><br/> Alyeska Resort provides a variety of services for wedding ceremonies, receptions, engagement parties, rehearsal dinners, and elopements. These services include:</p> <ul> <li>Accommodations</li> <li>Clean up</li> <li>Set up</li> <li>Buffet</li> <li>Bridal suite</li> <li>Liability insurance</li> <li>Event planning</li> <li>Outside vendors</li> </ul> <p><br/> <strong>Cuisine</strong><br/> Alyeska Resort has several restaurants, each with unique settings and specialties. It provides various serving options such as buffet, dessert, stations, plated, and more.<br/> <br/> <strong>Accommodation</strong><br/> The Hotel Alyeska provides luxurious accommodations for couples and guests. Its featured guest amenities include a 60-passenger aerial scenic tram, a saltwater pool, a whirlpool, a fitness center, and more.</p> </div>",16,2,200,4.6,"PO Box 249",Girdwood,99587,,9077541111,60.9602,-149.126,16,,4.6,4.6,4.7,4.5,4.5,http://www.alyeskaresort.com/meetings-weddings
3,"2018-11-22 10:14:49",image/jpeg,bad66b19b43a121708c56f3193be06f024339b61,114156,/ba/d6/6b/19/bad66b19b43a121708c56f3193be06f024339b61.jpg,,http://n3.datasn.io/data/api/v1/n3_lyz/wedding_service_information_of_usa_1/by_table/photo_image_access/ba/d6/6b/19/bad66b19b43a121708c56f3193be06f024339b61.jpg,3,"2018-11-12 12:04:27","Wedding ceremony",1,"2018-11-12 16:05:55","Alyeska Resort",Girdwood,"<p>Alyeska Resort is a premier wedding venue located in Girdwood, Alaska. Couples can host their dream wedding with the stunning Chugach Mountains as a backdrop. Settled in a valley surrounded by mountain peaks, glaciers, and a scenic view of the ocean, the venue provides guests with luxurious accommodations and access to the magnificent Alaskan wilderness.<br/> <br/> <strong>Facilities and Capacity</strong><br/> Alyeska Resort offers a variety of indoor and outdoor event spaces. From traditional banquet-style receptions to private outdoor celebrations, the venue offers spaces that are fully customizable to couples' preferences. The resort can accommodate a maximum of 200 guests in any of the following facilities:</p> <ul> <li>Columbia ballroom</li> <li>Kahiltna court</li> <li>Pond courtyard</li> </ul> <p><br/> <strong>Services Offered</strong><br/> Alyeska Resort provides a variety of services for wedding ceremonies, receptions, engagement parties, rehearsal dinners, and elopements. These services include:</p> <ul> <li>Accommodations</li> <li>Clean up</li> <li>Set up</li> <li>Buffet</li> <li>Bridal suite</li> <li>Liability insurance</li> <li>Event planning</li> <li>Outside vendors</li> </ul> <p><br/> <strong>Cuisine</strong><br/> Alyeska Resort has several restaurants, each with unique settings and specialties. It provides various serving options such as buffet, dessert, stations, plated, and more.<br/> <br/> <strong>Accommodation</strong><br/> The Hotel Alyeska provides luxurious accommodations for couples and guests. Its featured guest amenities include a 60-passenger aerial scenic tram, a saltwater pool, a whirlpool, a fitness center, and more.</p> </div>",16,2,200,4.6,"PO Box 249",Girdwood,99587,,9077541111,60.9602,-149.126,16,,4.6,4.6,4.7,4.5,4.5,http://www.alyeskaresort.com/meetings-weddings
4,"2018-11-22 10:15:02",image/jpeg,7b80375c508e9987f7f5a4807798ce338141686c,110305,/7b/80/37/5c/7b80375c508e9987f7f5a4807798ce338141686c.jpg,,http://n3.datasn.io/data/api/v1/n3_lyz/wedding_service_information_of_usa_1/by_table/photo_image_access/7b/80/37/5c/7b80375c508e9987f7f5a4807798ce338141686c.jpg,4,"2018-11-12 12:04:27","Couple portrait",1,"2018-11-12 16:05:55","Alyeska Resort",Girdwood,"<p>Alyeska Resort is a premier wedding venue located in Girdwood, Alaska. Couples can host their dream wedding with the stunning Chugach Mountains as a backdrop. Settled in a valley surrounded by mountain peaks, glaciers, and a scenic view of the ocean, the venue provides guests with luxurious accommodations and access to the magnificent Alaskan wilderness.<br/> <br/> <strong>Facilities and Capacity</strong><br/> Alyeska Resort offers a variety of indoor and outdoor event spaces. From traditional banquet-style receptions to private outdoor celebrations, the venue offers spaces that are fully customizable to couples' preferences. The resort can accommodate a maximum of 200 guests in any of the following facilities:</p> <ul> <li>Columbia ballroom</li> <li>Kahiltna court</li> <li>Pond courtyard</li> </ul> <p><br/> <strong>Services Offered</strong><br/> Alyeska Resort provides a variety of services for wedding ceremonies, receptions, engagement parties, rehearsal dinners, and elopements. These services include:</p> <ul> <li>Accommodations</li> <li>Clean up</li> <li>Set up</li> <li>Buffet</li> <li>Bridal suite</li> <li>Liability insurance</li> <li>Event planning</li> <li>Outside vendors</li> </ul> <p><br/> <strong>Cuisine</strong><br/> Alyeska Resort has several restaurants, each with unique settings and specialties. It provides various serving options such as buffet, dessert, stations, plated, and more.<br/> <br/> <strong>Accommodation</strong><br/> The Hotel Alyeska provides luxurious accommodations for couples and guests. Its featured guest amenities include a 60-passenger aerial scenic tram, a saltwater pool, a whirlpool, a fitness center, and more.</p> </div>",16,2,200,4.6,"PO Box 249",Girdwood,99587,,9077541111,60.9602,-149.126,16,,4.6,4.6,4.7,4.5,4.5,http://www.alyeskaresort.com/meetings-weddings
5,"2018-11-22 10:15:15",image/jpeg,13b02dc3c487c5da7510e98e7269e5bba4a016f4,108040,/13/b0/2d/c3/13b02dc3c487c5da7510e98e7269e5bba4a016f4.jpg,,http://n3.datasn.io/data/api/v1/n3_lyz/wedding_service_information_of_usa_1/by_table/photo_image_access/13/b0/2d/c3/13b02dc3c487c5da7510e98e7269e5bba4a016f4.jpg,5,"2018-11-12 12:04:27","Reception area",1,"2018-11-12 16:05:55","Alyeska Resort",Girdwood,"<p>Alyeska Resort is a premier wedding venue located in Girdwood, Alaska. Couples can host their dream wedding with the stunning Chugach Mountains as a backdrop. Settled in a valley surrounded by mountain peaks, glaciers, and a scenic view of the ocean, the venue provides guests with luxurious accommodations and access to the magnificent Alaskan wilderness.<br/> <br/> <strong>Facilities and Capacity</strong><br/> Alyeska Resort offers a variety of indoor and outdoor event spaces. From traditional banquet-style receptions to private outdoor celebrations, the venue offers spaces that are fully customizable to couples' preferences. The resort can accommodate a maximum of 200 guests in any of the following facilities:</p> <ul> <li>Columbia ballroom</li> <li>Kahiltna court</li> <li>Pond courtyard</li> </ul> <p><br/> <strong>Services Offered</strong><br/> Alyeska Resort provides a variety of services for wedding ceremonies, receptions, engagement parties, rehearsal dinners, and elopements. These services include:</p> <ul> <li>Accommodations</li> <li>Clean up</li> <li>Set up</li> <li>Buffet</li> <li>Bridal suite</li> <li>Liability insurance</li> <li>Event planning</li> <li>Outside vendors</li> </ul> <p><br/> <strong>Cuisine</strong><br/> Alyeska Resort has several restaurants, each with unique settings and specialties. It provides various serving options such as buffet, dessert, stations, plated, and more.<br/> <br/> <strong>Accommodation</strong><br/> The Hotel Alyeska provides luxurious accommodations for couples and guests. Its featured guest amenities include a 60-passenger aerial scenic tram, a saltwater pool, a whirlpool, a fitness center, and more.</p> </div>",16,2,200,4.6,"PO Box 249",Girdwood,99587,,9077541111,60.9602,-149.126,16,,4.6,4.6,4.7,4.5,4.5,http://www.alyeskaresort.com/meetings-weddings
6,"2018-11-22 10:20:03",image/jpeg,1c35b3f11a75d3f26f4813aca8ab583ee130bb68,85406,/1c/35/b3/f1/1c35b3f11a75d3f26f4813aca8ab583ee130bb68.jpg,,http://n3.datasn.io/data/api/v1/n3_lyz/wedding_service_information_of_usa_1/by_table/photo_image_access/1c/35/b3/f1/1c35b3f11a75d3f26f4813aca8ab583ee130bb68.jpg,6,"2018-11-12 12:04:27","Bridal portrait",1,"2018-11-12 16:05:55","Alyeska Resort",Girdwood,"<p>Alyeska Resort is a premier wedding venue located in Girdwood, Alaska. Couples can host their dream wedding with the stunning Chugach Mountains as a backdrop. Settled in a valley surrounded by mountain peaks, glaciers, and a scenic view of the ocean, the venue provides guests with luxurious accommodations and access to the magnificent Alaskan wilderness.<br/> <br/> <strong>Facilities and Capacity</strong><br/> Alyeska Resort offers a variety of indoor and outdoor event spaces. From traditional banquet-style receptions to private outdoor celebrations, the venue offers spaces that are fully customizable to couples' preferences. The resort can accommodate a maximum of 200 guests in any of the following facilities:</p> <ul> <li>Columbia ballroom</li> <li>Kahiltna court</li> <li>Pond courtyard</li> </ul> <p><br/> <strong>Services Offered</strong><br/> Alyeska Resort provides a variety of services for wedding ceremonies, receptions, engagement parties, rehearsal dinners, and elopements. These services include:</p> <ul> <li>Accommodations</li> <li>Clean up</li> <li>Set up</li> <li>Buffet</li> <li>Bridal suite</li> <li>Liability insurance</li> <li>Event planning</li> <li>Outside vendors</li> </ul> <p><br/> <strong>Cuisine</strong><br/> Alyeska Resort has several restaurants, each with unique settings and specialties. It provides various serving options such as buffet, dessert, stations, plated, and more.<br/> <br/> <strong>Accommodation</strong><br/> The Hotel Alyeska provides luxurious accommodations for couples and guests. Its featured guest amenities include a 60-passenger aerial scenic tram, a saltwater pool, a whirlpool, a fitness center, and more.</p> </div>",16,2,200,4.6,"PO Box 249",Girdwood,99587,,9077541111,60.9602,-149.126,16,,4.6,4.6,4.7,4.5,4.5,http://www.alyeskaresort.com/meetings-weddings
7,"2018-11-22 10:20:10",image/jpeg,9cb3d8005eae50df723776c1b7d9a11c6128b01f,115817,/9c/b3/d8/00/9cb3d8005eae50df723776c1b7d9a11c6128b01f.jpg,,http://n3.datasn.io/data/api/v1/n3_lyz/wedding_service_information_of_usa_1/by_table/photo_image_access/9c/b3/d8/00/9cb3d8005eae50df723776c1b7d9a11c6128b01f.jpg,7,"2018-11-12 12:04:27","Couple portrait",1,"2018-11-12 16:05:55","Alyeska Resort",Girdwood,"<p>Alyeska Resort is a premier wedding venue located in Girdwood, Alaska. Couples can host their dream wedding with the stunning Chugach Mountains as a backdrop. Settled in a valley surrounded by mountain peaks, glaciers, and a scenic view of the ocean, the venue provides guests with luxurious accommodations and access to the magnificent Alaskan wilderness.<br/> <br/> <strong>Facilities and Capacity</strong><br/> Alyeska Resort offers a variety of indoor and outdoor event spaces. From traditional banquet-style receptions to private outdoor celebrations, the venue offers spaces that are fully customizable to couples' preferences. The resort can accommodate a maximum of 200 guests in any of the following facilities:</p> <ul> <li>Columbia ballroom</li> <li>Kahiltna court</li> <li>Pond courtyard</li> </ul> <p><br/> <strong>Services Offered</strong><br/> Alyeska Resort provides a variety of services for wedding ceremonies, receptions, engagement parties, rehearsal dinners, and elopements. These services include:</p> <ul> <li>Accommodations</li> <li>Clean up</li> <li>Set up</li> <li>Buffet</li> <li>Bridal suite</li> <li>Liability insurance</li> <li>Event planning</li> <li>Outside vendors</li> </ul> <p><br/> <strong>Cuisine</strong><br/> Alyeska Resort has several restaurants, each with unique settings and specialties. It provides various serving options such as buffet, dessert, stations, plated, and more.<br/> <br/> <strong>Accommodation</strong><br/> The Hotel Alyeska provides luxurious accommodations for couples and guests. Its featured guest amenities include a 60-passenger aerial scenic tram, a saltwater pool, a whirlpool, a fitness center, and more.</p> </div>",16,2,200,4.6,"PO Box 249",Girdwood,99587,,9077541111,60.9602,-149.126,16,,4.6,4.6,4.7,4.5,4.5,http://www.alyeskaresort.com/meetings-weddings
8,"2018-11-22 10:20:20",image/jpeg,e53a7eb926f24213125ebf8137148979531b1bf1,131107,/e5/3a/7e/b9/e53a7eb926f24213125ebf8137148979531b1bf1.jpg,,http://n3.datasn.io/data/api/v1/n3_lyz/wedding_service_information_of_usa_1/by_table/photo_image_access/e5/3a/7e/b9/e53a7eb926f24213125ebf8137148979531b1bf1.jpg,8,"2018-11-12 12:04:27","Exterior view of Alyeska Resort",1,"2018-11-12 16:05:55","Alyeska Resort",Girdwood,"<p>Alyeska Resort is a premier wedding venue located in Girdwood, Alaska. Couples can host their dream wedding with the stunning Chugach Mountains as a backdrop. Settled in a valley surrounded by mountain peaks, glaciers, and a scenic view of the ocean, the venue provides guests with luxurious accommodations and access to the magnificent Alaskan wilderness.<br/> <br/> <strong>Facilities and Capacity</strong><br/> Alyeska Resort offers a variety of indoor and outdoor event spaces. From traditional banquet-style receptions to private outdoor celebrations, the venue offers spaces that are fully customizable to couples' preferences. The resort can accommodate a maximum of 200 guests in any of the following facilities:</p> <ul> <li>Columbia ballroom</li> <li>Kahiltna court</li> <li>Pond courtyard</li> </ul> <p><br/> <strong>Services Offered</strong><br/> Alyeska Resort provides a variety of services for wedding ceremonies, receptions, engagement parties, rehearsal dinners, and elopements. These services include:</p> <ul> <li>Accommodations</li> <li>Clean up</li> <li>Set up</li> <li>Buffet</li> <li>Bridal suite</li> <li>Liability insurance</li> <li>Event planning</li> <li>Outside vendors</li> </ul> <p><br/> <strong>Cuisine</strong><br/> Alyeska Resort has several restaurants, each with unique settings and specialties. It provides various serving options such as buffet, dessert, stations, plated, and more.<br/> <br/> <strong>Accommodation</strong><br/> The Hotel Alyeska provides luxurious accommodations for couples and guests. Its featured guest amenities include a 60-passenger aerial scenic tram, a saltwater pool, a whirlpool, a fitness center, and more.</p> </div>",16,2,200,4.6,"PO Box 249",Girdwood,99587,,9077541111,60.9602,-149.126,16,,4.6,4.6,4.7,4.5,4.5,http://www.alyeskaresort.com/meetings-weddings
9,"2018-11-22 10:20:28",image/jpeg,bf743935b0e786c32a086f0b582884f3aec7ee9a,116887,/bf/74/39/35/bf743935b0e786c32a086f0b582884f3aec7ee9a.jpg,,http://n3.datasn.io/data/api/v1/n3_lyz/wedding_service_information_of_usa_1/by_table/photo_image_access/bf/74/39/35/bf743935b0e786c32a086f0b582884f3aec7ee9a.jpg,9,"2018-11-12 12:04:27","Wedding ceremony",1,"2018-11-12 16:05:55","Alyeska Resort",Girdwood,"<p>Alyeska Resort is a premier wedding venue located in Girdwood, Alaska. Couples can host their dream wedding with the stunning Chugach Mountains as a backdrop. Settled in a valley surrounded by mountain peaks, glaciers, and a scenic view of the ocean, the venue provides guests with luxurious accommodations and access to the magnificent Alaskan wilderness.<br/> <br/> <strong>Facilities and Capacity</strong><br/> Alyeska Resort offers a variety of indoor and outdoor event spaces. From traditional banquet-style receptions to private outdoor celebrations, the venue offers spaces that are fully customizable to couples' preferences. The resort can accommodate a maximum of 200 guests in any of the following facilities:</p> <ul> <li>Columbia ballroom</li> <li>Kahiltna court</li> <li>Pond courtyard</li> </ul> <p><br/> <strong>Services Offered</strong><br/> Alyeska Resort provides a variety of services for wedding ceremonies, receptions, engagement parties, rehearsal dinners, and elopements. These services include:</p> <ul> <li>Accommodations</li> <li>Clean up</li> <li>Set up</li> <li>Buffet</li> <li>Bridal suite</li> <li>Liability insurance</li> <li>Event planning</li> <li>Outside vendors</li> </ul> <p><br/> <strong>Cuisine</strong><br/> Alyeska Resort has several restaurants, each with unique settings and specialties. It provides various serving options such as buffet, dessert, stations, plated, and more.<br/> <br/> <strong>Accommodation</strong><br/> The Hotel Alyeska provides luxurious accommodations for couples and guests. Its featured guest amenities include a 60-passenger aerial scenic tram, a saltwater pool, a whirlpool, a fitness center, and more.</p> </div>",16,2,200,4.6,"PO Box 249",Girdwood,99587,,9077541111,60.9602,-149.126,16,,4.6,4.6,4.7,4.5,4.5,http://www.alyeskaresort.com/meetings-weddings
10,"2018-11-22 10:20:29",image/jpeg,929f248093b41fadaf8297211971aba056644c2a,73027,/92/9f/24/80/929f248093b41fadaf8297211971aba056644c2a.jpg,,http://n3.datasn.io/data/api/v1/n3_lyz/wedding_service_information_of_usa_1/by_table/photo_image_access/92/9f/24/80/929f248093b41fadaf8297211971aba056644c2a.jpg,800001,"2018-11-13 19:12:54","Table setting",9793,"2018-11-13 19:12:54","Glamorous Events & Decor","Los Angeles","<p>Glamorous Events & Decor is a wedding planner located in Los Angeles, California. They aim to help couples enjoy the planning experience without any of the stress. Glamorous Events & Decor plans weddings throughout the greater Los Angeles region. This includes Orange County, San Bernardino and Temecula. Let Glamorous Events plan your special day!<br/> <br/> <strong>Experience</strong><br/> The company was founded in 1996 by Laura Zitouni. She has over 20 years of event planning experience and has worked with hundreds of couples.<br/> <br/> <strong>Services Offered</strong><br/> Thanks to her wealth of experience, Laura is confident in her style of wedding planning. Between her great sense of humor and range of creative services, you can enjoy the big day. These offerings include:</p> <ul> <li>Budget analysis</li> <li>Day-of coordination</li> <li>Event design</li> <li>Full planning</li> <li>Partial planning</li> <li>Referrals</li> <li>Timelines</li> <li>Furniture rentals</li> </ul> </div>",13,,,5.0,""",","Los Angeles",90051,,8002370561,34.0627,-118.243,13,"$995 (Package Price)",5.0,5.0,5.0,5.0,5.0,http://glamorousevent.net